BDBM50296226 2-Adamantan-1-yl-N-[4-(3-morpholin-4-yl-propoxy)-phenyl]-acetamide::CHEMBL549576
SMILES O=C(CC12CC3CC(CC(C3)C1)C2)Nc1ccc(OCCCN2CCOCC2)cc1
InChI Key InChIKey=BXZVMRCSXVXBPB-UHFFFAOYSA-N
Data  1 IC50
  Tab Delimited (TSV)   2D SDfile   Computed 3D by Vconf -m prep SDfile
Find this compound or compounds like it in BindingDB:
Activity Spreadsheet -- Enzyme Inhibition Constant Data from BindingDB
Found 1 hit for monomerid = 50296226
TargetBifunctional epoxide hydrolase 2(Homo sapiens (Human))
Arete Therapeutics
Curated by ChEMBL
LigandPNGBDBM50296226(2-Adamantan-1-yl-N-[4-(3-morpholin-4-yl-propoxy)-p...)
Affinity DataIC50:  1.30nM. Assay description: Inhibition of human soluble epoxide hydrolase by fluorescent endpoint assay
In DepthDetails ArticlePubMed