BDBM50296318 CHEMBL4177124
SMILES CCCCCCc1ccc(Oc2ccccc2Br)c(O)c1
InChI Key InChIKey=XMFJZZCTDKMLKQ-UHFFFAOYSA-N
Data  1 KI  1 IC50
PDB links: 1 PDB ID matches this monomer.
  Tab Delimited (TSV)   2D SDfile   Computed 3D by Vconf -m prep SDfile
Find this compound or compounds like it in BindingDB:
Activity Spreadsheet -- Enzyme Inhibition Constant Data from BindingDB
Found 2 hits for monomerid = 50296318
TargetEnoyl-[acyl-carrier-protein] reductase [NADH](Mycobacterium tuberculosis (strain ATCC 25618 / H3...)
Cnrs
Curated by ChEMBL
LigandPNGBDBM50296318(CHEMBL4177124)
Affinity DataKi:  0.200nM. Assay description: Inhibition of Mycobacterium tuberculosis InhA
TargetEnoyl-[acyl-carrier-protein] reductase [NADH](Mycobacterium tuberculosis (strain ATCC 25618 / H3...)
Cnrs
Curated by ChEMBL
LigandPNGBDBM50296318(CHEMBL4177124)
Affinity DataIC50:  10nM. Assay description: Inhibition of Mycobacterium tuberculosis InhA