BDBM50296325 (3R)-3-{[(9-Hydroxy-9H-fluoren-9-yl)carbonyl]oxy}-1-(3-phenoxypropyl)-1-azoniabicyclo[2.2.2]octane bromide::CHEMBL561870::US9333195, 100
SMILES OC1(C(=O)O[C@H]2C[N+]3(CCCOc4ccccc4)CCC2CC3)c2ccccc2-c2ccccc12
InChI Key InChIKey=ZMGKLIJUSAOHFP-JHHOKDCISA-N
Data  4 IC50
  Tab Delimited (TSV)   2D SDfile   Computed 3D by Vconf -m prep SDfile
Find this compound or compounds like it in BindingDB:
Activity Spreadsheet -- Enzyme Inhibition Constant Data from BindingDB
Found 4 hits for monomerid = 50296325
TargetMuscarinic acetylcholine receptor M3(Homo sapiens (Human))
Almirall
US Patent
LigandPNGBDBM50296325((3R)-3-{[(9-Hydroxy-9H-fluoren-9-yl)carbonyl]oxy}-...)
Affinity DataIC50:  14nM. Assay description: The binding of [3H]-NMS to human muscarinic receptors was performed according to Waelbroek et al (1990) (1). Assays were carried out at 25° C. Membra...
In DepthDetails US Patent
TargetMuscarinic acetylcholine receptor M1(Homo sapiens (Human))
RhôNe-Poulenc Rorer
Curated by ChEMBL
LigandPNGBDBM50296325((3R)-3-{[(9-Hydroxy-9H-fluoren-9-yl)carbonyl]oxy}-...)
Affinity DataIC50:  0.630nM. Assay description: Displacement of [3H]NMS from human muscarinic M1 receptor expressed in CHOK1 cells by microplate scintillation counting
In DepthDetails ArticlePubMed
TargetMuscarinic acetylcholine receptor M3(Homo sapiens (Human))
Almirall
US Patent
LigandPNGBDBM50296325((3R)-3-{[(9-Hydroxy-9H-fluoren-9-yl)carbonyl]oxy}-...)
Affinity DataIC50:  0.710nM. Assay description: Displacement of [3H]NMS from human muscarinic M3 receptor expressed in CHOK1 cells by microplate scintillation counting
In DepthDetails ArticlePubMed
TargetMuscarinic acetylcholine receptor M2(Homo sapiens (Human))
RhôNe-Poulenc Rorer
Curated by ChEMBL
LigandPNGBDBM50296325((3R)-3-{[(9-Hydroxy-9H-fluoren-9-yl)carbonyl]oxy}-...)
Affinity DataIC50:  1.08nM. Assay description: Displacement of [3H]NMS from human muscarinic M2 receptor expressed in CHOK1 cells by microplate scintillation counting
In DepthDetails ArticlePubMed