BDBM50296415 4-(5-(2-chlorobenzylthio)-1,3,4-oxadiazol-2-yl)-N-(thiophen-2-ylmethyl)benzenesulfonamide::CHEMBL563825
SMILES Clc1ccccc1CSc1nnc(o1)-c1ccc(cc1)S(=O)(=O)NCc1cccs1
InChI Key InChIKey=ASJIAILLRMGHSE-UHFFFAOYSA-N
Data  3 KI
  Tab Delimited (TSV)   2D SDfile   Computed 3D by Vconf -m prep SDfile
Find this compound or compounds like it in BindingDB:
Activity Spreadsheet -- Enzyme Inhibition Constant Data from BindingDB
Found 3 hits for monomerid = 50296415
TargetCarboxypeptidase B(Helicoverpa zea (Corn earworm moth) (Heliothis zea...)
Universitat Aut£Noma De Barcelona
Curated by ChEMBL
LigandPNGBDBM50296415(4-(5-(2-chlorobenzylthio)-1,3,4-oxadiazol-2-yl)-N-...)
Affinity DataKi:  1.40E+3nM. Assay description: Inhibition of corn earworm recombinant carboxypeptidase B expressed in Pichia pastoris system
In DepthDetails ArticlePubMed
TargetCarboxypeptidase B(Homo sapiens (Human))
Universitat Aut£Noma De Barcelona
Curated by ChEMBL
LigandPNGBDBM50296415(4-(5-(2-chlorobenzylthio)-1,3,4-oxadiazol-2-yl)-N-...)
Affinity DataKi:  4.00E+4nM. Assay description: Inhibition of human recombinant carboxypeptidase B expressed in Pichia pastoris system
In DepthDetails ArticlePubMed
TargetCarboxypeptidase A1(Bos taurus (bovine))
Universitat Aut£Noma De Barcelona
Curated by ChEMBL
LigandPNGBDBM50296415(4-(5-(2-chlorobenzylthio)-1,3,4-oxadiazol-2-yl)-N-...)
Affinity DataKi:  6.73E+4nM. Assay description: Inhibition of bovine carboxypeptidase A1
In DepthDetails ArticlePubMed