BDBM50296421 2-(4-benzyl-5-(thiophen-2-yl)-4H-1,2,4-triazol-3-ylthio)acetamide::CHEMBL561935
SMILES NC(=O)CSc1nnc(-c2cccs2)n1Cc1ccccc1
InChI Key InChIKey=CVKKOKLNCJLUEW-UHFFFAOYSA-N
Data  3 KI
  Tab Delimited (TSV)   2D SDfile   Computed 3D by Vconf -m prep SDfile
Find this compound or compounds like it in BindingDB:
Activity Spreadsheet -- Enzyme Inhibition Constant Data from BindingDB
Found 3 hits for monomerid = 50296421
TargetCarboxypeptidase B(Homo sapiens (Human))
Universitat Aut£Noma De Barcelona
Curated by ChEMBL
LigandPNGBDBM50296421(2-(4-benzyl-5-(thiophen-2-yl)-4H-1,2,4-triazol-3-y...)
Affinity DataKi:  1.16E+4nM. Assay description: Inhibition of human recombinant carboxypeptidase B expressed in Pichia pastoris system
In DepthDetails ArticlePubMed
TargetCarboxypeptidase B(Helicoverpa zea (Corn earworm moth) (Heliothis zea...)
Universitat Aut£Noma De Barcelona
Curated by ChEMBL
LigandPNGBDBM50296421(2-(4-benzyl-5-(thiophen-2-yl)-4H-1,2,4-triazol-3-y...)
Affinity DataKi:  2.72E+4nM. Assay description: Inhibition of corn earworm recombinant carboxypeptidase B expressed in Pichia pastoris system
In DepthDetails ArticlePubMed
TargetCarboxypeptidase A1(Bos taurus (bovine))
Universitat Aut£Noma De Barcelona
Curated by ChEMBL
LigandPNGBDBM50296421(2-(4-benzyl-5-(thiophen-2-yl)-4H-1,2,4-triazol-3-y...)
Affinity DataKi:  1.55E+5nM. Assay description: Inhibition of bovine carboxypeptidase A1
In DepthDetails ArticlePubMed