BDBM50296659 4-chloro-N-cyclopropyl-3-(1-(2,5-difluorophenyl)-7-methyl-6-oxo-6,7-dihydro-1H-pyrazolo[3,4-b]pyridin-4-yloxy)benzamide::CHEMBL558711
SMILES Cn1c2n(ncc2c(Oc2cc(ccc2Cl)C(=O)NC2CC2)cc1=O)-c1cc(F)ccc1F
InChI Key InChIKey=BLNGFYMVTVVSOK-UHFFFAOYSA-N
Data  1 IC50
  Tab Delimited (TSV)   2D SDfile   Computed 3D by Vconf -m prep SDfile
Find this compound or compounds like it in BindingDB:
Activity Spreadsheet -- Enzyme Inhibition Constant Data from BindingDB
Found 1 hit for monomerid = 50296659
TargetMitogen-activated protein kinase 14(Homo sapiens (Human))
Amgen
Curated by ChEMBL
LigandPNGBDBM50296659(4-chloro-N-cyclopropyl-3-(1-(2,5-difluorophenyl)-7...)
Affinity DataIC50:  3.30nM. Assay description: Inhibition of human recombinant p38alpha assessed as phosphorylation of ATF2 by scintillation proximity assay
In DepthDetails ArticlePubMed