BDBM50296805 5-ethyl-2-(2-(4-(1-methylpiperidin-4-yl)piperazin-1-yl)pyridin-3-yl)-4H-benzo[d][1,3]oxazin-4-one::CHEMBL564055
SMILES CCc1cccc2nc(oc(=O)c12)-c1cccnc1N1CCN(CC1)C1CCN(C)CC1
InChI Key InChIKey=UKDHSIYUBSOPCS-UHFFFAOYSA-N
Data  1 IC50
  Tab Delimited (TSV)   2D SDfile   Computed 3D by Vconf -m prep SDfile
Find this compound or compounds like it in BindingDB:
Activity Spreadsheet -- Enzyme Inhibition Constant Data from BindingDB
Found 1 hit for monomerid = 50296805
TargetNeutrophil elastase(Homo sapiens (Human))
Activx Biosciences
Curated by ChEMBL
LigandPNGBDBM50296805(5-ethyl-2-(2-(4-(1-methylpiperidin-4-yl)piperazin-...)
Affinity DataIC50:  8.5nM. Assay description: Inhibition of human sputum neutrophil elastase by fluorescence based assay
In DepthDetails ArticlePubMed