BDBM50296833 (S)-1-(3-(5-ethyl-7-methoxy-4-oxo-4H-benzo[d][1,3]oxazin-2-yl)pyridin-2-yl)piperidine-3-carboxylic acid::CHEMBL562390
SMILES CCc1cc(OC)cc2nc(oc(=O)c12)-c1cccnc1N1CCC[C@@H](C1)C(O)=O
InChI Key InChIKey=YIJFVTHTWPIZQI-AWEZNQCLSA-N
Data  1 IC50
  Tab Delimited (TSV)   2D SDfile   Computed 3D by Vconf -m prep SDfile
Find this compound or compounds like it in BindingDB:
Activity Spreadsheet -- Enzyme Inhibition Constant Data from BindingDB
Found 1 hit for monomerid = 50296833
TargetNeutrophil elastase(Homo sapiens (Human))
Activx Biosciences
Curated by ChEMBL
LigandPNGBDBM50296833((S)-1-(3-(5-ethyl-7-methoxy-4-oxo-4H-benzo[d][1,3]...)
Affinity DataIC50:  25nM. Assay description: Inhibition of human sputum neutrophil elastase by fluorescence based assay
In DepthDetails ArticlePubMed