BDBM50296938 16-(Phenylmethylidene)-17beta-hydroxy-4-methyl-4-aza-5alpha-androst-1-en-3-one::CHEMBL560935
SMILES CN1[C@@H]2CC[C@H]3[C@@H]4C\C(=C/c5ccccc5)[C@H](O)[C@@]4(C)CC[C@@H]3[C@@]2(C)C=CC1=O
InChI Key InChIKey=UICYMQZXHRACIG-KPKWYKMHSA-N
Data  1 KI  1 IC50  1 EC50
  Tab Delimited (TSV)   2D SDfile   Computed 3D by Vconf -m prep SDfile
Find this compound or compounds like it in BindingDB:
Activity Spreadsheet -- Enzyme Inhibition Constant Data from BindingDB
Found 3 hits for monomerid = 50296938
TargetPotassium voltage-gated channel subfamily H member 2(Homo sapiens (Human))
Merck Research Laboratories
Curated by ChEMBL
LigandPNGBDBM50296938(16-(Phenylmethylidene)-17beta-hydroxy-4-methyl-4-a...)
Affinity DataKi:  225nM. Assay description: Binding affinity to human ERG potassium channel
In DepthDetails ArticlePubMed
TargetAndrogen receptor(Homo sapiens (Human))
Merck Research Laboratories
Curated by ChEMBL
LigandPNGBDBM50296938(16-(Phenylmethylidene)-17beta-hydroxy-4-methyl-4-a...)
Affinity DataIC50:  116nM. Assay description: Displacement of [3H]methyltrienolone from androgen receptor in human MDA-MB-453 cells
In DepthDetails ArticlePubMed
TargetAndrogen receptor(Homo sapiens (Human))
Merck Research Laboratories
Curated by ChEMBL
LigandPNGBDBM50296938(16-(Phenylmethylidene)-17beta-hydroxy-4-methyl-4-a...)
Affinity DataEC50:  26nM. Assay description: Agonist activity at androgen receptor in human MDA-MB-453 cells transfected with MMTV-LUC assessed as induction of MMTV-LTR/promoter linked LUC gene ...
In DepthDetails ArticlePubMed