BDBM50297142 (R)-3-Hydroxy-7-methyl-5,6,7,8-tetrahydro-10-thia-5,8-diaza-benzo[a]azulen-9-one::CHEMBL559487
SMILES C[C@@H]1CNc2c(sc3ccc(O)cc23)C(=O)N1
InChI Key InChIKey=GWODBBFDCZIKBY-ZCFIWIBFSA-N
Data  3 IC50
  Tab Delimited (TSV)   2D SDfile   Computed 3D by Vconf -m prep SDfile
Find this compound or compounds like it in BindingDB:
Activity Spreadsheet -- Enzyme Inhibition Constant Data from BindingDB
Found 3 hits for monomerid = 50297142
TargetMAP kinase-activated protein kinase 2(Homo sapiens (Human))
Pfizer
Curated by ChEMBL
LigandPNGBDBM50297142((R)-3-Hydroxy-7-methyl-5,6,7,8-tetrahydro-10-thia-...)
Affinity DataIC50:  190nM. Assay description: Inhibition of MK2
In DepthDetails ArticlePubMed
TargetMAP kinase-activated protein kinase 2(Homo sapiens (Human))
Pfizer
Curated by ChEMBL
LigandPNGBDBM50297142((R)-3-Hydroxy-7-methyl-5,6,7,8-tetrahydro-10-thia-...)
Affinity DataIC50:  3.50E+3nM. Assay description: Inhibition of MK2 in human U937 cells assessed as blockade of LPS-stimulated TNFalpha production
In DepthDetails ArticlePubMed
TargetCyclin-dependent kinase 1(Homo sapiens (Human))
Pfizer
Curated by ChEMBL
LigandPNGBDBM50297142((R)-3-Hydroxy-7-methyl-5,6,7,8-tetrahydro-10-thia-...)
Affinity DataIC50:  26nM. Assay description: Inhibition of CDK2
In DepthDetails ArticlePubMed