BDBM50297346 CHEMBL4167741
SMILES COc1cc2c(Oc3ccc(NC(=O)NN4C(SCC4=O)c4c(F)cccc4F)cc3)ccnc2cc1OCCCN1CCCC1
InChI Key InChIKey=OHEKPYDPMXZOGA-UHFFFAOYSA-N
Data  1 IC50
  Tab Delimited (TSV)   2D SDfile   Computed 3D by Vconf -m prep SDfile
Find this compound or compounds like it in BindingDB:
Activity Spreadsheet -- Enzyme Inhibition Constant Data from BindingDB
Found 1 hit for monomerid = 50297346
TargetHepatocyte growth factor receptor(Homo sapiens (Human))
Zhuhai Campus Of Zunyi Medical University
Curated by ChEMBL
LigandPNGBDBM50297346(CHEMBL4167741)
Affinity DataIC50:  37nM. Assay description: Inhibition of c-Met (unknown origin) using poly (Glu,Tyr) 4:1 as substrate after 1 hr by ELISA
In DepthDetails ArticlePubMed