BDBM50297442 CHEMBL555902::N-((2S,3R,4R,5S)-5-(2-chloro-4-fluorobenzamido)-3,4-dihydroxy-1,6-diphenylhexan-2-yl)-2,3-dihydrobenzo[b][1,4]dioxine-6-carboxamide
SMILES O[C@@H]([C@H](O)[C@H](Cc1ccccc1)NC(=O)c1ccc(F)cc1Cl)[C@H](Cc1ccccc1)NC(=O)c1ccc2OCCOc2c1
InChI Key InChIKey=SUPRDXRBKFNKHZ-DSOCELCXSA-N
Data  2 IC50
  Tab Delimited (TSV)   2D SDfile   Computed 3D by Vconf -m prep SDfile
Find this compound or compounds like it in BindingDB:
Activity Spreadsheet -- Enzyme Inhibition Constant Data from BindingDB
Found 2 hits for monomerid = 50297442
TargetPlasmepsin II(Plasmodium falciparum)
National University Of Singapore
Curated by ChEMBL
LigandPNGBDBM50297442(CHEMBL555902 | N-((2S,3R,4R,5S)-5-(2-chloro-4-fluo...)
Affinity DataIC50:  1.18E+4nM. Assay description: Inhibition of Plasmodium falciparum plasmepsin-2 in fluorescence microplate assay
In DepthDetails ArticlePubMed
TargetPlasmepsin I(Plasmodium falciparum)
National University Of Singapore
Curated by ChEMBL
LigandPNGBDBM50297442(CHEMBL555902 | N-((2S,3R,4R,5S)-5-(2-chloro-4-fluo...)
Affinity DataIC50: >2.50E+4nM. Assay description: Inhibition of Plasmodium falciparum plasmepsin-1 in fluorescence microplate assay
In DepthDetails ArticlePubMed