BDBM50297562 CHEMBL563178::N''-[2-(1,3-benzothiazol-2-ylthio)-5,6-dimethoxy-2,3-dihydro-1H-inden-1-ylidene]carbonohydrazonic diamide dihydrochloride
SMILES [#6]-[#8]-c1cc2-[#6]-[#6](-[#16]-c3nc4ccccc4s3)-[#6](=[#7]\[#7]=[#6](\[#7])-[#7])-c2cc1-[#8]-[#6]
InChI Key InChIKey=KTPXURDXLVCAIX-UHFFFAOYSA-N
Data  1 IC50
  Tab Delimited (TSV)   2D SDfile   Computed 3D by Vconf -m prep SDfile
Find this compound or compounds like it in BindingDB:
Activity Spreadsheet -- Enzyme Inhibition Constant Data from BindingDB
Found 1 hit for monomerid = 50297562
TargetSodium/hydrogen exchanger 1(Rattus norvegicus)
China Pharmaceutical University
Curated by ChEMBL
LigandPNGBDBM50297562(CHEMBL563178 | N''-[2-(1,3-benzothiazol-2-ylthio)-...)
Affinity DataIC50:  2.44nM. Assay description: Inhibition of NHE1 in Sprague-Dawley rat platelet-rich plasma by optical swelling assay
In DepthDetails ArticlePubMed