BDBM50297574 CHEMBL557259::N''-[2-(1H-benzimidazol-2-ylthio)-5-chloro-2,3-dihydro-1H-inden-1-ylidene]carbonohydrazonic diamide
SMILES NC(N)=NN=C1C(Cc2cc(Cl)ccc12)Sc1nc2ccccc2[nH]1
InChI Key InChIKey=SURCNDDIUIUQIF-UHFFFAOYSA-N
Data  1 IC50
  Tab Delimited (TSV)   2D SDfile   Computed 3D by Vconf -m prep SDfile
Find this compound or compounds like it in BindingDB:
Activity Spreadsheet -- Enzyme Inhibition Constant Data from BindingDB
Found 1 hit for monomerid = 50297574
TargetSodium/hydrogen exchanger 1(Rattus norvegicus)
China Pharmaceutical University
Curated by ChEMBL
LigandPNGBDBM50297574(CHEMBL557259 | N''-[2-(1H-benzimidazol-2-ylthio)-5...)
Affinity DataIC50:  21.4nM. Assay description: Inhibition of NHE1 in Sprague-Dawley rat platelet-rich plasma by optical swelling assay
In DepthDetails ArticlePubMed