BDBM50297945 3-(6-((3-(2,6-dichlorophenyl)-5-isopropylisoxazol-4-yl)methoxy)naphthalen-2-yl)benzoic acid::CHEMBL559554
SMILES CC(C)c1onc(c1COc1ccc2cc(ccc2c1)-c1cccc(c1)C(O)=O)-c1c(Cl)cccc1Cl
InChI Key InChIKey=YVOPPIZWLWECBK-UHFFFAOYSA-N
Data  2 EC50
  Tab Delimited (TSV)   2D SDfile   Computed 3D by Vconf -m prep SDfile
Find this compound or compounds like it in BindingDB:
Activity Spreadsheet -- Enzyme Inhibition Constant Data from BindingDB
Found 2 hits for monomerid = 50297945
TargetBile acid receptor(Homo sapiens (Human))
Glaxosmithkline
Curated by ChEMBL
LigandPNGBDBM50297945(3-(6-((3-(2,6-dichlorophenyl)-5-isopropylisoxazol-...)
Affinity DataEC50:  130nM. Assay description: Increase in human FXR-mediated transient transcription of luciferase reporter gene transfected in african green monkey CV1 cells
In DepthDetails ArticlePubMed
TargetBile acid receptor(Homo sapiens (Human))
Glaxosmithkline
Curated by ChEMBL
LigandPNGBDBM50297945(3-(6-((3-(2,6-dichlorophenyl)-5-isopropylisoxazol-...)
Affinity DataEC50:  110nM. Assay description: Induction of SRC1 coactivator peptide binding to ligand binding domain of human FXR by FRET assay
In DepthDetails ArticlePubMed