BDBM50297960 5-(imidazo[1,2-a]pyridin-3-yl)-3-(2-(trifluoromethyl)benzyloxy)thiophene-2-carboxamide::CHEMBL564431
SMILES NC(=O)c1sc(cc1OCc1ccccc1C(F)(F)F)-c1cnc2ccccn12
InChI Key InChIKey=PXZAVZVJLWBDCB-UHFFFAOYSA-N
Data  1 IC50  1 EC50
  Tab Delimited (TSV)   2D SDfile   Computed 3D by Vconf -m prep SDfile
Find this compound or compounds like it in BindingDB:
Activity Spreadsheet -- Enzyme Inhibition Constant Data from BindingDB
Found 2 hits for monomerid = 50297960
TargetSerine/threonine-protein kinase PLK1(Homo sapiens (Human))
Banyu Tsukuba Research Institute
Curated by ChEMBL
LigandPNGBDBM50297960(5-(imidazo[1,2-a]pyridin-3-yl)-3-(2-(trifluorometh...)
Affinity DataIC50:  22nM. Assay description: Inhibition of PLK1
In DepthDetails ArticlePubMed
TargetSerine/threonine-protein kinase PLK1(Homo sapiens (Human))
Banyu Tsukuba Research Institute
Curated by ChEMBL
LigandPNGBDBM50297960(5-(imidazo[1,2-a]pyridin-3-yl)-3-(2-(trifluorometh...)
Affinity DataEC50:  5.00E+3nM. Assay description: Inhibition of PLK1-mediated mitosis in human HeLaS3 cells after 18 hrs
In DepthDetails ArticlePubMed