BDBM50298308 3-(1-ethyl-5-methyl-1H-pyrazol-4-yl)-N-(2-morpholinoethyl)-4,5-dihydroisoxazole-5-carboxamide::CHEMBL572904
SMILES CCn1ncc(C2=NOC(C2)C(=O)NCCN2CCOCC2)c1C
InChI Key InChIKey=KGVCXMBIHCWOCU-UHFFFAOYSA-N
Data  1 IC50
  Tab Delimited (TSV)   2D SDfile   Computed 3D by Vconf -m prep SDfile
Find this compound or compounds like it in BindingDB:
Activity Spreadsheet -- Enzyme Inhibition Constant Data from BindingDB
Found 1 hit for monomerid = 50298308
Target5-hydroxytryptamine receptor 2C(Homo sapiens (Human))
Institute Of Science And Technology
Curated by ChEMBL
LigandPNGBDBM50298308(3-(1-ethyl-5-methyl-1H-pyrazol-4-yl)-N-(2-morpholi...)
Affinity DataIC50: >1.00E+4nM. Assay description: Displacement of [3H]Mesulergine from human recombinant serotonin 5-HT2C expressed in CHO-K1 cells
In DepthDetails ArticlePubMed