BDBM50298594 (S)-2-(2-(7-fluoro-1H-indole-2-carboxamido)benzamido)-3-phenylpropanoic acid::CHEMBL574292
SMILES OC(=O)[C@H](Cc1ccccc1)NC(=O)c1ccccc1NC(=O)c1cc2cccc(F)c2[nH]1
InChI Key InChIKey=ZKMGIBHOEPRHRQ-NRFANRHFSA-N
Data  1 IC50
  Tab Delimited (TSV)   2D SDfile   Computed 3D by Vconf -m prep SDfile
Find this compound or compounds like it in BindingDB:
Activity Spreadsheet -- Enzyme Inhibition Constant Data from BindingDB
Found 1 hit for monomerid = 50298594
TargetCholecystokinin receptor type A(RAT)
Aristotelian University Of Thessaloniki
Curated by ChEMBL
LigandPNGBDBM50298594((S)-2-(2-(7-fluoro-1H-indole-2-carboxamido)benzami...)
Affinity DataIC50:  3.55E+3nM. Assay description: Displacement of [125I]-CCK8 from CCK1 receptor in rat pancreatic acinar cells
In DepthDetails ArticlePubMed