BDBM50298743 CHEMBL573527::benzyl(2S,5S,8S,11S,14S)-14-formyl-1-hydroxy-5,8-bis(hydroxymethyl)-11-isobutyl-16-methyl-3,6,9,12-tetraoxo-4,7,10,13-tetraazaheptadecan-2-ylcarbamate
SMILES CC(C)C[C@H](NC(=O)[C@H](CC(C)C)NC(=O)[C@H](CO)NC(=O)[C@H](CO)NC(=O)[C@H](CO)NC(=O)OCc1ccccc1)C=O
InChI Key InChIKey=UQTHWEZMENLQHB-LSBAASHUSA-N
Data  1 KI
  Tab Delimited (TSV)   2D SDfile   Computed 3D by Vconf -m prep SDfile
Find this compound or compounds like it in BindingDB:
Activity Spreadsheet -- Enzyme Inhibition Constant Data from BindingDB
Found 1 hit for monomerid = 50298743
TargetProstate-specific antigen(Homo sapiens (Human))
The Johns Hopkins University School Of Medicine
Curated by ChEMBL
LigandPNGBDBM50298743(CHEMBL573527 | benzyl(2S,5S,8S,11S,14S)-14-formyl-...)
Affinity DataKi:  19.9nM. Assay description: Inhibition of prostate-specific antigen assessed as substrate hydrolysis by fluorescence assay
In DepthDetails ArticlePubMed