BDBM50298817 5-((3S)-3-(2-methoxy-2'-methylbiphenyl-4-yl)but-1-ynyl)-6-methylpyrimidine-2,4-diamine::CHEMBL573406
SMILES COc1cc(ccc1-c1ccccc1C)[C@H](C)C#Cc1c(C)nc(N)nc1N
InChI Key InChIKey=GWGFEUVZNZOACY-CQSZACIVSA-N
Data  1 IC50
  Tab Delimited (TSV)   2D SDfile   Computed 3D by Vconf -m prep SDfile
Find this compound or compounds like it in BindingDB:
Activity Spreadsheet -- Enzyme Inhibition Constant Data from BindingDB
Found 1 hit for monomerid = 50298817
TargetDihydrofolate reductase(Candida albicans)
University Of Connecticut
Curated by ChEMBL
LigandPNGBDBM50298817(5-((3S)-3-(2-methoxy-2'-methylbiphenyl-4-yl)but-1-...)
Affinity DataIC50:  27nM. Assay description: Inhibition of Candida albicans DHFR expressed in Escherichia coli BL21 (DE3) assessed as rate of NADPH consumption using dihydrofolate as susbtrate
In DepthDetails ArticlePubMed