BDBM50299059 CHEMBL573934::N-Hydroxy-2-(4'-methoxybiphenyl-4-ylsulfonyl)benzamide
SMILES COc1ccc(cc1)-c1ccc(cc1)S(=O)(=O)c1ccccc1C(=O)NO
InChI Key InChIKey=OREDIHYKGISTDR-UHFFFAOYSA-N
Data  9 IC50
  Tab Delimited (TSV)   2D SDfile   Computed 3D by Vconf -m prep SDfile
Find this compound or compounds like it in BindingDB:
Activity Spreadsheet -- Enzyme Inhibition Constant Data from BindingDB
Found 9 hits for monomerid = 50299059
TargetMatrix metalloproteinase-14(Homo sapiens (Human))
Universit£
Curated by ChEMBL
LigandPNGBDBM50299059(CHEMBL573934 | N-Hydroxy-2-(4'-methoxybiphenyl-4-y...)
Affinity DataIC50:  1.30E+3nM. Assay description: Inhibition of human recombinant pro-MMP14 catalytic domain after 4 hrs by fluorimetry
In DepthDetails ArticlePubMed
TargetMatrix metalloproteinase-9(Homo sapiens (Human))
Universit£
Curated by ChEMBL
LigandPNGBDBM50299059(CHEMBL573934 | N-Hydroxy-2-(4'-methoxybiphenyl-4-y...)
Affinity DataIC50:  930nM. Assay description: Inhibition of para-aminophenylmercuric acetate-activated human recombinant pro-MMP9 catalytic domain after 4 hrs by fluorimetry
In DepthDetails ArticlePubMed
TargetMacrophage metalloelastase(Homo sapiens (Human))
Universit£
Curated by ChEMBL
LigandPNGBDBM50299059(CHEMBL573934 | N-Hydroxy-2-(4'-methoxybiphenyl-4-y...)
Affinity DataIC50:  70nM. Assay description: Inhibition of autoactivated human pro-MMP12 after 4 hrs by fluorimetry
In DepthDetails ArticlePubMed
TargetNeutrophil collagenase(Homo sapiens (Human))
Universit£
Curated by ChEMBL
LigandPNGBDBM50299059(CHEMBL573934 | N-Hydroxy-2-(4'-methoxybiphenyl-4-y...)
Affinity DataIC50:  87nM. Assay description: Inhibition of para-aminophenylmercuric acetate-activated human pro-MMP8 after 4 hrs by fluorimetry
In DepthDetails ArticlePubMed
TargetInterstitial collagenase(Homo sapiens (Human))
Universit£
Curated by ChEMBL
LigandPNGBDBM50299059(CHEMBL573934 | N-Hydroxy-2-(4'-methoxybiphenyl-4-y...)
Affinity DataIC50:  2.80E+4nM. Assay description: Inhibition of para-aminophenylmercuric acetate-activated human pro-MMP1 after 4 hrs by fluorimetry
In DepthDetails ArticlePubMed
TargetCollagenase 3(Homo sapiens (Human))
Universit£
Curated by ChEMBL
LigandPNGBDBM50299059(CHEMBL573934 | N-Hydroxy-2-(4'-methoxybiphenyl-4-y...)
Affinity DataIC50:  260nM. Assay description: Inhibition of para-aminophenylmercuric acetate-activated human pro-MMP13 after 4 hrs by fluorimetry
In DepthDetails ArticlePubMed
TargetMatrix metalloproteinase-16(Homo sapiens (Human))
Universit£
Curated by ChEMBL
LigandPNGBDBM50299059(CHEMBL573934 | N-Hydroxy-2-(4'-methoxybiphenyl-4-y...)
Affinity DataIC50:  1.20E+3nM. Assay description: Inhibition of human recombinant pro-MMP16 catalytic domain after 4 hrs by fluorimetry
In DepthDetails ArticlePubMed
TargetStromelysin-1(Homo sapiens (Human))
Universit£
Curated by ChEMBL
LigandPNGBDBM50299059(CHEMBL573934 | N-Hydroxy-2-(4'-methoxybiphenyl-4-y...)
Affinity DataIC50:  4.00E+3nM. Assay description: Inhibition of trypsin activated human pro-MMP3 after 4 hrs by fluorimetry
In DepthDetails ArticlePubMed
Target72 kDa type IV collagenase(Homo sapiens (Human))
Universit£
Curated by ChEMBL
LigandPNGBDBM50299059(CHEMBL573934 | N-Hydroxy-2-(4'-methoxybiphenyl-4-y...)
Affinity DataIC50:  100nM. Assay description: Inhibition of para-aminophenylmercuric acetate-activated human recombinant pro-MMP2 catalytic domain after 4 hrs by fluorimetry
In DepthDetails ArticlePubMed