BDBM50299208 4-amino-6-methyl-2-(3-(4-p-tolylpiperazin-1-yl)propyl)-5-vinylpyridazin-3(2H)-one::CHEMBL584606
SMILES Cc1ccc(cc1)N1CCN(CCCn2nc(C)c(C=C)c(N)c2=O)CC1
InChI Key InChIKey=SSHKNPUBWWFZGC-UHFFFAOYSA-N
Data  3 IC50
  Tab Delimited (TSV)   2D SDfile   Computed 3D by Vconf -m prep SDfile
Find this compound or compounds like it in BindingDB:
Activity Spreadsheet -- Enzyme Inhibition Constant Data from BindingDB
Found 3 hits for monomerid = 50299208
TargetAlpha-2A adrenergic receptor(Homo sapiens (Human))
Dipartimento Di Scienze Farmaceutiche
Curated by ChEMBL
LigandPNGBDBM50299208(4-amino-6-methyl-2-(3-(4-p-tolylpiperazin-1-yl)pro...)
Affinity DataIC50:  320nM. Assay description: Displacement of [3H]MK9112 from human recombinant adrenergic alpha2A receptor expressed in insect Sf9 cells after 60 mins
In DepthDetails ArticlePubMed
TargetAlpha-1A adrenergic receptor(Rattus norvegicus (Rat))
Dipartimento Di Scienze Farmaceutiche
Curated by ChEMBL
LigandPNGBDBM50299208(4-amino-6-methyl-2-(3-(4-p-tolylpiperazin-1-yl)pro...)
Affinity DataIC50:  56nM. Assay description: Displacement of [3H]prazosin from adrenergic alpha1A receptor in Wistar rat submaxillary gland after 60 mins
In DepthDetails ArticlePubMed
TargetAlpha-1B adrenergic receptor(Rattus norvegicus (rat))
Dipartimento Di Scienze Farmaceutiche
Curated by ChEMBL
LigandPNGBDBM50299208(4-amino-6-methyl-2-(3-(4-p-tolylpiperazin-1-yl)pro...)
Affinity DataIC50:  102nM. Assay description: Displacement of [3H]prazosin from adrenergic alpha1B receptor in Wistar rat liver membrane after 60 mins
In DepthDetails ArticlePubMed