BDBM50299241 3-(5-(4-Fluorophenyl)-1H-imidazol-2-yl)-5H dibenzo[b,e][1,4]diazepin-11(10H)-one::CHEMBL573162
SMILES Fc1ccc(cc1)-c1c[nH]c(NC(=O)c2ccc3c(Nc4ccccc4NC3=O)c2)n1
InChI Key InChIKey=OWMCRLCVNNKMLM-UHFFFAOYSA-N
Data  1 KI
  Tab Delimited (TSV)   2D SDfile   Computed 3D by Vconf -m prep SDfile
Find this compound or compounds like it in BindingDB:
Activity Spreadsheet -- Enzyme Inhibition Constant Data from BindingDB
Found 1 hit for monomerid = 50299241
TargetBeta-secretase 1(Homo sapiens (Human))
University Of Sharjah
Curated by ChEMBL
LigandPNGBDBM50299241(3-(5-(4-Fluorophenyl)-1H-imidazol-2-yl)-5H dibenzo...)
Affinity DataKi:  293nM. Assay description: Inhibition of human recombinant BACE1 by FRET assay
In DepthDetails ArticlePubMed