BDBM50299530 5-fluoro-2-methoxy-N-(pyridin-3-yl)benzenesulfonamide::CHEMBL568090::US10370333, Example XIII-1::cid_16654595
SMILES COc1ccc(F)cc1S(=O)(=O)Nc1cccnc1
InChI Key InChIKey=RQSBJKFFDPIXKJ-UHFFFAOYSA-N
Data  3 IC50
  Tab Delimited (TSV)   2D SDfile   Computed 3D by Vconf -m prep SDfile
Find this compound or compounds like it in BindingDB:
Activity Spreadsheet -- Enzyme Inhibition Constant Data from BindingDB
Found 3 hits for monomerid = 50299530
TargetAlkaline phosphatase, tissue-nonspecific isozyme(Homo sapiens (Human))
Burnham Center For Chemical Genomics
Curated by PubChem BioAssay
LigandPNGBDBM50299530(5-fluoro-2-methoxy-N-(pyridin-3-yl)benzenesulfonam...)
Affinity DataIC50:  1.29E+3nM. Assay description: Sanford-Burnham Center for Chemical Genomics (SBCCG) Sanford-Burnham Medical Research Institute (SBMRI, San Diego, CA) NIH Molecular Libraries Screen...
In DepthDetails PCBioAssay
TargetAlkaline phosphatase, tissue-nonspecific isozyme(Homo sapiens (Human))
Burnham Center For Chemical Genomics
Curated by PubChem BioAssay
LigandPNGBDBM50299530(5-fluoro-2-methoxy-N-(pyridin-3-yl)benzenesulfonam...)
Affinity DataIC50: <100nM. Assay description: To determine the inhibition selectivity for inhibitor candidates, human TNAP, PLAP or IAP were added to microtiter plates followed by addition of the...
In DepthDetails US Patent
TargetAlkaline phosphatase, tissue-nonspecific isozyme(Homo sapiens (Human))
Burnham Center For Chemical Genomics
Curated by PubChem BioAssay
LigandPNGBDBM50299530(5-fluoro-2-methoxy-N-(pyridin-3-yl)benzenesulfonam...)
Affinity DataIC50:  1.29E+3nM. Assay description: Inhibition of TNAP transfected in african green monkey COS1 cells by colorimetric assay
In DepthDetails ArticlePubMed