BDBM50299631 3-[5-(3,4-Difluorophenyl)-2-thienyl]phenol::CHEMBL566521
SMILES Oc1cccc(c1)-c1ccc(s1)-c1ccc(F)c(F)c1
InChI Key InChIKey=PKUPEZBIFLWEBN-UHFFFAOYSA-N
Data  2 IC50
  Tab Delimited (TSV)   2D SDfile   Computed 3D by Vconf -m prep SDfile
Find this compound or compounds like it in BindingDB:
Activity Spreadsheet -- Enzyme Inhibition Constant Data from BindingDB
Found 2 hits for monomerid = 50299631
Target17-beta-hydroxysteroid dehydrogenase type 2(Homo sapiens (Human))
Saarland University
Curated by ChEMBL
LigandPNGBDBM50299631(3-[5-(3,4-Difluorophenyl)-2-thienyl]phenol | CHEMB...)
Affinity DataIC50:  2.64E+3nM. Assay description: Inhibition of human placental 17betaHSD2 by radiodetection assay
In DepthDetails ArticlePubMed
Target17-beta-hydroxysteroid dehydrogenase type 1(Homo sapiens (Human))
Saarland University
Curated by ChEMBL
LigandPNGBDBM50299631(3-[5-(3,4-Difluorophenyl)-2-thienyl]phenol | CHEMB...)
Affinity DataIC50:  780nM. Assay description: Inhibition of human placental 17betaHSD1 by radiodetection assay
In DepthDetails ArticlePubMed