BDBM50299709 4-Cyclohexyl-1-[2-(5-methoxy-1,2,3,4-tetrahydronaphthalen-1-yloxy)ethyl]piperidine::CHEMBL574155
SMILES COc1cccc2C(CCCc12)OCCN1CCC(CC1)C1CCCCC1
InChI Key InChIKey=KLNBYXPVESPEMQ-UHFFFAOYSA-N
Data  1 KI
  Tab Delimited (TSV)   2D SDfile   Computed 3D by Vconf -m prep SDfile
Find this compound or compounds like it in BindingDB:
Activity Spreadsheet -- Enzyme Inhibition Constant Data from BindingDB
Found 1 hit for monomerid = 50299709
TargetSigma non-opioid intracellular receptor 1(Cavia porcellus (Guinea pig))
Universita Degli Studi Di Bari
Curated by ChEMBL
LigandPNGBDBM50299709(4-Cyclohexyl-1-[2-(5-methoxy-1,2,3,4-tetrahydronap...)
Affinity DataKi:  91nM. Assay description: Displacement of [3H](+)-pentazocine ((+)-[2S-(2R,6R,11R)]-1,2,3,4,5,6-hexahydro-6,11-dimethyl- 3-(3-methyl-2-butenyl)-2,6-methano-3-benzazocine- 8-ol...
In DepthDetails ArticlePubMed