BDBM50299721 1-cyclohexylpiperazine::CHEMBL574165
SMILES CC(=O)N1CCN(CC1)C1CCCCC1
InChI Key InChIKey=HOHAKIGCFPDJJI-UHFFFAOYSA-N
Data  2 KI
  Tab Delimited (TSV)   2D SDfile   Computed 3D by Vconf -m prep SDfile
Find this compound or compounds like it in BindingDB:
Activity Spreadsheet -- Enzyme Inhibition Constant Data from BindingDB
Found 2 hits for monomerid = 50299721
Target3-beta-hydroxysteroid-Delta(8),Delta(7)-isomerase(Cavia porcellus)
Universita Degli Studi Di Bari
Curated by ChEMBL
LigandPNGBDBM50299721(1-cyclohexylpiperazine | CHEMBL574165)
Affinity DataKi: >1.00E+3nM. Assay description: Displacement of [3H](+/-)-emopamil from EBP in Dunkin guinea pig liver membrane by radioreceptor binding assay
In DepthDetails ArticlePubMed
TargetSigma non-opioid intracellular receptor 1(Cavia porcellus (Guinea pig))
Universita Degli Studi Di Bari
Curated by ChEMBL
LigandPNGBDBM50299721(1-cyclohexylpiperazine | CHEMBL574165)
Affinity DataKi: >5.00E+3nM. Assay description: Displacement of [3H](+)-pentazocine ((+)-[2S-(2R,6R,11R)]-1,2,3,4,5,6-hexahydro-6,11-dimethyl- 3-(3-methyl-2-butenyl)-2,6-methano-3-benzazocine- 8-ol...
In DepthDetails ArticlePubMed