BDBM50300569 (R)-2-(3-(3-((2-chloro-3-(trifluoromethyl)benzyl)(2,2-diphenylethyl)amino)butoxy)phenyl)-2-methylpropanoic acid::CHEMBL584568
SMILES C[C@H](CCOc1cccc(c1)C(C)(C)C(O)=O)N(CC(c1ccccc1)c1ccccc1)Cc1cccc(c1Cl)C(F)(F)F
InChI Key InChIKey=DWBDSQMGSRVGMI-RUZDIDTESA-N
Data  2 EC50
  Tab Delimited (TSV)   2D SDfile   Computed 3D by Vconf -m prep SDfile
Find this compound or compounds like it in BindingDB:
Activity Spreadsheet -- Enzyme Inhibition Constant Data from BindingDB
Found 2 hits for monomerid = 50300569
TargetOxysterols receptor LXR-alpha(Homo sapiens (Human))
Glaxosmithkline
Curated by ChEMBL
LigandPNGBDBM50300569((R)-2-(3-(3-((2-chloro-3-(trifluoromethyl)benzyl)(...)
Affinity DataEC50:  9nM. Assay description: Agonist activity at human LXRalpha assessed as association of SRC1 to LXRalpha ligand binding domain by FRET based cell-free ligand sensing assay
In DepthDetails ArticlePubMed
TargetOxysterols receptor LXR-beta(Homo sapiens (Human))
Glaxosmithkline
Curated by ChEMBL
LigandPNGBDBM50300569((R)-2-(3-(3-((2-chloro-3-(trifluoromethyl)benzyl)(...)
Affinity DataEC50:  11nM. Assay description: Agonist activity at human LXRbeta assessed as association of SRC1 to LXRbeta ligand binding domain by FRET based cell-free ligand sensing assay
In DepthDetails ArticlePubMed