BDBM50300572 2-(3-(3-((2-chloro-3-(trifluoromethyl)benzyl)(2,2-diphenylethyl)amino)propoxy)phenyl)-2-methylpropanoic acid::CHEMBL573679
SMILES CC(C)(C(O)=O)c1cccc(OCCCN(CC(c2ccccc2)c2ccccc2)Cc2cccc(c2Cl)C(F)(F)F)c1
InChI Key InChIKey=IAXOISXBOXYVMG-UHFFFAOYSA-N
Data  2 EC50
  Tab Delimited (TSV)   2D SDfile   Computed 3D by Vconf -m prep SDfile
Find this compound or compounds like it in BindingDB:
Activity Spreadsheet -- Enzyme Inhibition Constant Data from BindingDB
Found 2 hits for monomerid = 50300572
TargetOxysterols receptor LXR-alpha(Homo sapiens (Human))
Glaxosmithkline
Curated by ChEMBL
LigandPNGBDBM50300572(2-(3-(3-((2-chloro-3-(trifluoromethyl)benzyl)(2,2-...)
Affinity DataEC50:  43nM. Assay description: Agonist activity at human LXRalpha assessed as association of SRC1 to LXRalpha ligand binding domain by FRET based cell-free ligand sensing assay
In DepthDetails ArticlePubMed
TargetOxysterols receptor LXR-beta(Homo sapiens (Human))
Glaxosmithkline
Curated by ChEMBL
LigandPNGBDBM50300572(2-(3-(3-((2-chloro-3-(trifluoromethyl)benzyl)(2,2-...)
Affinity DataEC50:  15nM. Assay description: Agonist activity at human LXRbeta assessed as association of SRC1 to LXRbeta ligand binding domain by FRET based cell-free ligand sensing assay
In DepthDetails ArticlePubMed