BDBM50300692 CHEMBL578024::N-(5-tert-Butyl-isoxazol-3-yl)-N'-[4-(imidazo[2,1-b][1,3]benzothiazol-2-yl)phenyl]urea
SMILES CC(C)(C)c1cc(NC(=O)Nc2ccc(cc2)-c2cn3c(n2)sc2ccccc32)no1
InChI Key InChIKey=IWPSRKCWTYJWAS-UHFFFAOYSA-N
Data  1 Kd
  Tab Delimited (TSV)   2D SDfile   Computed 3D by Vconf -m prep SDfile
Find this compound or compounds like it in BindingDB:
Activity Spreadsheet -- Enzyme Inhibition Constant Data from BindingDB
Found 1 hit for monomerid = 50300692
TargetReceptor-type tyrosine-protein kinase FLT3(Homo sapiens (Human))
Ambit Biosciences
Curated by ChEMBL
LigandPNGBDBM50300692(CHEMBL578024 | N-(5-tert-Butyl-isoxazol-3-yl)-N'-[...)
Affinity DataKd:  1.90nM. Assay description: Binding affinity to FLT3 catalytic domain expressed in HEK293 cells by competitive binding assay
In DepthDetails ArticlePubMed