BDBM50300834 2-(3-{[3-(Trifluoromethyl)phenyl]sulfonyl}-1Hpyrrolo[2,3-b]pyridin-1-yl)ethylamine::CHEMBL584049
SMILES NCCn1cc(c2cccnc12)S(=O)(=O)c1cccc(c1)C(F)(F)F
InChI Key InChIKey=GHFZBISJZYICNU-UHFFFAOYSA-N
Data  1 KI  1 EC50
  Tab Delimited (TSV)   2D SDfile   Computed 3D by Vconf -m prep SDfile
Find this compound or compounds like it in BindingDB:
Activity Spreadsheet -- Enzyme Inhibition Constant Data from BindingDB
Found 2 hits for monomerid = 50300834
Target5-hydroxytryptamine receptor 6(Homo sapiens (Human))
Wyeth Research
Curated by ChEMBL
LigandPNGBDBM50300834(2-(3-{[3-(Trifluoromethyl)phenyl]sulfonyl}-1Hpyrro...)
Affinity DataKi:  2.10nM. Assay description: Displacement of [3H]LSD from human cloned 5HT6 receptor expressed in HeLa cells
In DepthDetails ArticlePubMed
Target5-hydroxytryptamine receptor 6(Homo sapiens (Human))
Wyeth Research
Curated by ChEMBL
LigandPNGBDBM50300834(2-(3-{[3-(Trifluoromethyl)phenyl]sulfonyl}-1Hpyrro...)
Affinity DataEC50:  110nM. Assay description: Agonist activity at human cloned 5HT6 receptor expressed in HeLa cells assessed as induction of adenylyl cyclase activity by RIA
In DepthDetails ArticlePubMed