BDBM50300835 CHEMBL565977::N-(2-{3-[(3,5-Dichlorophenyl)sulfonyl]-1H-pyrrolo[2,3-b]pyridin-1-yl}ethyl)-N,N-dimethylamine
SMILES CN(C)CCn1cc(c2cccnc12)S(=O)(=O)c1cc(Cl)cc(Cl)c1
InChI Key InChIKey=XKGPWJVSSXUSSG-UHFFFAOYSA-N
Data  1 KI  1 EC50
  Tab Delimited (TSV)   2D SDfile   Computed 3D by Vconf -m prep SDfile
Find this compound or compounds like it in BindingDB:
Activity Spreadsheet -- Enzyme Inhibition Constant Data from BindingDB
Found 2 hits for monomerid = 50300835
Target5-hydroxytryptamine receptor 6(Homo sapiens (Human))
Wyeth Research
Curated by ChEMBL
LigandPNGBDBM50300835(CHEMBL565977 | N-(2-{3-[(3,5-Dichlorophenyl)sulfon...)
Affinity DataKi:  4.30nM. Assay description: Displacement of [3H]LSD from human cloned 5HT6 receptor expressed in HeLa cells
In DepthDetails ArticlePubMed
Target5-hydroxytryptamine receptor 6(Homo sapiens (Human))
Wyeth Research
Curated by ChEMBL
LigandPNGBDBM50300835(CHEMBL565977 | N-(2-{3-[(3,5-Dichlorophenyl)sulfon...)
Affinity DataEC50:  28nM. Assay description: Agonist activity at human cloned 5HT6 receptor expressed in HeLa cells assessed as induction of adenylyl cyclase activity by RIA
In DepthDetails ArticlePubMed