BDBM50300839 2-[3-(1-Naphthylsulfonyl)-1H-pyrrolo[2,3-b]pyridin-1-yl]ethylamine::CHEMBL585930
SMILES NCCn1cc(c2cccnc12)S(=O)(=O)c1cccc2ccccc12
InChI Key InChIKey=IQEJNMFCUWSNIB-UHFFFAOYSA-N
Data  1 KI  1 EC50
  Tab Delimited (TSV)   2D SDfile   Computed 3D by Vconf -m prep SDfile
Find this compound or compounds like it in BindingDB:
Activity Spreadsheet -- Enzyme Inhibition Constant Data from BindingDB
Found 2 hits for monomerid = 50300839
Target5-hydroxytryptamine receptor 6(Homo sapiens (Human))
Wyeth Research
Curated by ChEMBL
LigandPNGBDBM50300839(2-[3-(1-Naphthylsulfonyl)-1H-pyrrolo[2,3-b]pyridin...)
Affinity DataKi:  1.60nM. Assay description: Displacement of [3H]LSD from human cloned 5HT6 receptor expressed in HeLa cells
In DepthDetails ArticlePubMed
Target5-hydroxytryptamine receptor 6(Homo sapiens (Human))
Wyeth Research
Curated by ChEMBL
LigandPNGBDBM50300839(2-[3-(1-Naphthylsulfonyl)-1H-pyrrolo[2,3-b]pyridin...)
Affinity DataEC50:  63nM. Assay description: Agonist activity at human cloned 5HT6 receptor expressed in HeLa cells assessed as induction of adenylyl cyclase activity by RIA
In DepthDetails ArticlePubMed