BDBM50301136 (S)-5-guanidino-2-((R)-2-((S)-2-(3-(4-hydroxyphenyl)propanamido)-3-(1H-imidazol-5-yl)propanamido)-3-phenylpropanamido)pentanamide::CHEMBL567039
SMILES NC(N)=NCCC[C@@H](NC(=O)[C@@H](Cc1ccccc1)NC(=O)[C@H](Cc1cnc[nH]1)NC(=O)CCc1ccc(O)cc1)C(N)=O
InChI Key InChIKey=FYUIPKSDJUFFLG-SDHSZQHLSA-N
Data  2 EC50
  Tab Delimited (TSV)   2D SDfile   Computed 3D by Vconf -m prep SDfile
Find this compound or compounds like it in BindingDB:
Activity Spreadsheet -- Enzyme Inhibition Constant Data from BindingDB
Found 2 hits for monomerid = 50301136
TargetMelanocortin receptor 5(Mus musculus (Mouse))
University Of Cincinnati
Curated by ChEMBL
LigandPNGBDBM50301136((S)-5-guanidino-2-((R)-2-((S)-2-(3-(4-hydroxypheny...)
Affinity DataEC50:  1.05E+4nM. Assay description: Agonistic activity against mouse MC5R
In DepthDetails ArticlePubMed
TargetMelanocyte-stimulating hormone receptor(Mus musculus)
University Of Cincinnati
Curated by ChEMBL
LigandPNGBDBM50301136((S)-5-guanidino-2-((R)-2-((S)-2-(3-(4-hydroxypheny...)
Affinity DataEC50:  1.16E+3nM. Assay description: Agonistic activity against mouse MC1R
In DepthDetails ArticlePubMed