BDBM50301479 1-(4-(2-(4-acetylpiperazin-1-yl)ethoxy)-3-(1-methyl-1H-pyrazol-5-yl)phenyl)-3-(4-chlorophenyl)urea::CHEMBL584924
SMILES CC(=O)N1CCN(CCOc2ccc(NC(=O)Nc3ccc(Cl)cc3)cc2-c2ccnn2C)CC1
InChI Key InChIKey=ZEUZXAUGKPYBBW-UHFFFAOYSA-N
Data  2 KI
  Tab Delimited (TSV)   2D SDfile   Computed 3D by Vconf -m prep SDfile
Find this compound or compounds like it in BindingDB:
Activity Spreadsheet -- Enzyme Inhibition Constant Data from BindingDB
Found 2 hits for monomerid = 50301479
Target5-hydroxytryptamine receptor 2A(Homo sapiens (Human))
Arena Pharmaceuticals
Curated by ChEMBL
LigandPNGBDBM50301479(1-(4-(2-(4-acetylpiperazin-1-yl)ethoxy)-3-(1-methy...)
Affinity DataKi:  0.960nM. Assay description: Displacement of [125I]DOI from 5HT2A receptor expressed in HEK cells
In DepthDetails ArticlePubMed
Target5-hydroxytryptamine receptor 2C(Homo sapiens (Human))
Arena Pharmaceuticals
Curated by ChEMBL
LigandPNGBDBM50301479(1-(4-(2-(4-acetylpiperazin-1-yl)ethoxy)-3-(1-methy...)
Affinity DataKi:  216nM. Assay description: Binding affinity to 5HT2C receptor expressed in HEK cells
In DepthDetails ArticlePubMed