BDBM50301548 CHEMBL568102::trans-N-(4-(trifluoromethoxy)benzyl)-2-(5-(4-(trifluoromethoxy)phenyl)-4,5-dihydroisoxazol-3-yl)cyclopentanecarboxamide
SMILES FC(F)(F)Oc1ccc(CNC(=O)[C@@H]2CCC[C@H]2C2=NOC(C2)c2ccc(OC(F)(F)F)cc2)cc1
InChI Key InChIKey=ITERKECVEHKRQM-AQFHOAJTSA-N
Data  1 IC50
  Tab Delimited (TSV)   2D SDfile   Computed 3D by Vconf -m prep SDfile
Find this compound or compounds like it in BindingDB:
Activity Spreadsheet -- Enzyme Inhibition Constant Data from BindingDB
Found 1 hit for monomerid = 50301548
TargetSodium channel protein type 9 subunit alpha(Homo sapiens (Human))
Merck Research Laboratories
Curated by ChEMBL
LigandPNGBDBM50301548(CHEMBL568102 | trans-N-(4-(trifluoromethoxy)benzyl...)
Affinity DataIC50:  500nM. Assay description: Inhibition of human Nav1.7 channel expressed in HEK cells by FRET assay
In DepthDetails ArticlePubMed