BDBM50301730 (1R,2R)-N-(3-hydroxy-1-phenylcyclobutyl)-2-(5-phenylisoxazol-3-yl)cyclopentanecarboxamide::CHEMBL571090
SMILES OC1CC(C1)(NC(=O)[C@@H]1CCC[C@H]1c1cc(on1)-c1ccccc1)c1ccccc1
InChI Key InChIKey=QUFYXGTYVGQRNB-IYZJKTGWSA-N
Data  1 IC50
  Tab Delimited (TSV)   2D SDfile   Computed 3D by Vconf -m prep SDfile
Find this compound or compounds like it in BindingDB:
Activity Spreadsheet -- Enzyme Inhibition Constant Data from BindingDB
Found 1 hit for monomerid = 50301730
TargetSodium channel protein type 9 subunit alpha(Homo sapiens (Human))
Merck Research Laboratories
Curated by ChEMBL
LigandPNGBDBM50301730((1R,2R)-N-(3-hydroxy-1-phenylcyclobutyl)-2-(5-phen...)
Affinity DataIC50: >5.00E+3nM. Assay description: Inhibition of human Nav1.7 channel expressed in HEK293 cells by FRET assay
In DepthDetails ArticlePubMed