BDBM50301943 (3S,6S,9S,12S,15S,21S)-21-((S)-2-((S)-2-amino-3-(1H-imidazol-5-yl)propanamido)propanamido)-3-((S)-1-((S)-1-amino-3-(biphenyl-4-yl)-1-oxopropan-2-ylamino)-3-(2'-ethylbiphenyl-4-yl)-1-oxopropan-2-ylcarbamoyl)-12-benzyl-9,15-bis((R)-1-hydroxyethyl)-6-(hydroxymethyl)-5,8,11,14,17,20-hexaoxo-4,7,10,13,16,19-hexaazatetracosane-1,24-dioic acid::CHEMBL576917
SMILES CCc1ccccc1-c1ccc(C[C@H](NC(=O)[C@H](CC(O)=O)NC(=O)[C@H](CO)NC(=O)[C@@H](NC(=O)[C@H](Cc2ccccc2)NC(=O)[C@@H](NC(=O)CNC(=O)[C@H](CCC(O)=O)NC(=O)[C@H](C)NC(=O)[C@@H](N)Cc2cnc[nH]2)[C@@H](C)O)[C@@H](C)O)C(=O)N[C@@H](Cc2ccc(cc2)-c2ccccc2)C(N)=O)cc1
InChI Key InChIKey=VOMLSQQPOVSYPK-NFXDKDBXSA-N
Data  1 EC50
  Tab Delimited (TSV)   2D SDfile   Computed 3D by Vconf -m prep SDfile
Find this compound or compounds like it in BindingDB:
Activity Spreadsheet -- Enzyme Inhibition Constant Data from BindingDB
Found 1 hit for monomerid = 50301943
TargetGlucagon-like peptide 1 receptor(Homo sapiens (Human))
Bristol-Myers Squibb
Curated by ChEMBL
LigandPNGBDBM50301943((3S,6S,9S,12S,15S,21S)-21-((S)-2-((S)-2-amino-3-(1...)
Affinity DataEC50:  27nM. Assay description: Agonist activity at human GLP1R expressed in CHO cells assessed as stimulation of intracellular [3H]cAMP accumulation after 30 mins by scintillation ...
In DepthDetails ArticlePubMed