BDBM50302481 CHEMBL567503::N-(3,3-diphenylpropyl)-6-oxo-1,6-dihydropyridine-3-carboxamide
SMILES O=C(NCCC(c1ccccc1)c1ccccc1)c1ccc(=O)[nH]c1
InChI Key InChIKey=WDGKZCSQFVUANE-UHFFFAOYSA-N
Data  2 IC50
  Tab Delimited (TSV)   2D SDfile   Computed 3D by Vconf -m prep SDfile
Find this compound or compounds like it in BindingDB:
Activity Spreadsheet -- Enzyme Inhibition Constant Data from BindingDB
Found 2 hits for monomerid = 50302481
TargetBifunctional epoxide hydrolase 2(Homo sapiens (Human))
Boehringer Ingelheim Pharmaceuticals
Curated by ChEMBL
LigandPNGBDBM50302481(CHEMBL567503 | N-(3,3-diphenylpropyl)-6-oxo-1,6-di...)
Affinity DataIC50:  8.10nM. Assay description: Inhibition of human soluble EH
In DepthDetails ArticlePubMed
TargetBifunctional epoxide hydrolase 2(Rattus norvegicus)
Boehringer Ingelheim Pharmaceuticals
Curated by ChEMBL
LigandPNGBDBM50302481(CHEMBL567503 | N-(3,3-diphenylpropyl)-6-oxo-1,6-di...)
Affinity DataIC50:  10nM. Assay description: Inhibition of rat sEH
In DepthDetails ArticlePubMed