BDBM50302900 7-methoxy-4-((6-phenyl-[1,2,4]triazolo[4,3-b]pyridazin-3-yl)methylthio)quinoline::CHEMBL567089
SMILES COc1ccc2c(SCc3nnc4ccc(nn34)-c3ccccc3)ccnc2c1
InChI Key InChIKey=LSZYMWXOOBDCEC-UHFFFAOYSA-N
Data  3 IC50
  Tab Delimited (TSV)   2D SDfile   Computed 3D by Vconf -m prep SDfile
Find this compound or compounds like it in BindingDB:
Activity Spreadsheet -- Enzyme Inhibition Constant Data from BindingDB
Found 3 hits for monomerid = 50302900
TargetHepatocyte growth factor receptor(Homo sapiens (Human))
Amgen
Curated by ChEMBL
LigandPNGBDBM50302900(7-methoxy-4-((6-phenyl-[1,2,4]triazolo[4,3-b]pyrid...)
Affinity DataIC50: >6.67E+3nM. Assay description: Inhibition of c-Met by HTRF assay
In DepthDetails ArticlePubMed
TargetCytochrome P450 3A4(Homo sapiens (Human))
Amgen
Curated by ChEMBL
LigandPNGBDBM50302900(7-methoxy-4-((6-phenyl-[1,2,4]triazolo[4,3-b]pyrid...)
Affinity DataIC50:  7.00E+3nM. Assay description: Inhibition of human CYP3A4 in human liver microsomes preincubated with NADPH
In DepthDetails ArticlePubMed
TargetCytochrome P450 3A4(Homo sapiens (Human))
Amgen
Curated by ChEMBL
LigandPNGBDBM50302900(7-methoxy-4-((6-phenyl-[1,2,4]triazolo[4,3-b]pyrid...)
Affinity DataIC50:  4.50E+3nM. Assay description: Inhibition of human CYP3A4
In DepthDetails ArticlePubMed