BDBM50303270 CHEMBL566215::N1-(4-(2-(1-ethyl-1H-imidazole-4-carbonyl)thieno[3,2-b]pyridin-7-yloxy)-3-fluorophenyl)-N3-(2-fluorophenyl)malonamide
SMILES CCn1cnc(c1)-c1cc2nccc(Oc3ccc(NC(=O)CC(=O)Nc4ccccc4F)cc3F)c2s1
InChI Key InChIKey=PNZXGVDDWVRAON-UHFFFAOYSA-N
Data  3 IC50
  Tab Delimited (TSV)   2D SDfile   Computed 3D by Vconf -m prep SDfile
Find this compound or compounds like it in BindingDB:
Activity Spreadsheet -- Enzyme Inhibition Constant Data from BindingDB
Found 3 hits for monomerid = 50303270
TargetVascular endothelial growth factor receptor 2(Homo sapiens (Human))
Methylgene
Curated by ChEMBL
LigandPNGBDBM50303270(CHEMBL566215 | N1-(4-(2-(1-ethyl-1H-imidazole-4-ca...)
Affinity DataIC50:  18nM. Assay description: Inhibition of GST-fused recombinant VEGFR2 expressed in baculovirus infected Sf9 cells after 10 mins by DELFIA assay
In DepthDetails ArticlePubMed
TargetHepatocyte growth factor receptor(Homo sapiens (Human))
Methylgene
Curated by ChEMBL
LigandPNGBDBM50303270(CHEMBL566215 | N1-(4-(2-(1-ethyl-1H-imidazole-4-ca...)
Affinity DataIC50:  35nM. Assay description: Inhibition of TPR-met autophosphorylation expressed in HEK293T cells after 150 mins by ELISA
In DepthDetails ArticlePubMed
TargetHepatocyte growth factor receptor(Homo sapiens (Human))
Methylgene
Curated by ChEMBL
LigandPNGBDBM50303270(CHEMBL566215 | N1-(4-(2-(1-ethyl-1H-imidazole-4-ca...)
Affinity DataIC50:  32nM. Assay description: Inhibition of GST-fused recombinant C-met expressed in baculovirus infected high five cells after 30 mins by DELFIA assay
In DepthDetails ArticlePubMed