BDBM50303399 CHEMBL566933::S-2-(3-chloro-4-methylphenylamino)-2-oxoethyl carbamothioate::cid_873495
SMILES Cc1ccc(NC(=O)CSC(N)=O)cc1Cl
InChI Key InChIKey=YUTNYKCJOPVWMD-UHFFFAOYSA-N
Data  3 IC50
  Tab Delimited (TSV)   2D SDfile   Computed 3D by Vconf -m prep SDfile
Find this compound or compounds like it in BindingDB:
Activity Spreadsheet -- Enzyme Inhibition Constant Data from BindingDB
Found 3 hits for monomerid = 50303399
TargetPolyadenylate-binding protein 1(Homo sapiens (Human))
Burnham Center For Chemical Genomics
Curated by PubChem BioAssay
LigandPNGBDBM50303399(CHEMBL566933 | S-2-(3-chloro-4-methylphenylamino)-...)
Affinity DataIC50: >6.60E+4nM. Assay description: Data Source: Sanford-Burnham Center for Chemical Genomics (SBCCG) Source Affiliation: Sanford-Burnham Medical Research Institute (SBMRI, San Diego, C...
In DepthDetails PCBioAssay
TargetCruzipain(Trypanosoma cruzi)
National Human Genome Research Institute
Curated by ChEMBL
LigandPNGBDBM50303399(CHEMBL566933 | S-2-(3-chloro-4-methylphenylamino)-...)
Affinity DataIC50: >1.20E+5nM. Assay description: Inhibition of Tryapanosom cruzi cruzain by Flexstation microplate spectrofluorometry
In DepthDetails ArticlePubMed
TargetCruzipain(Trypanosoma cruzi)
National Human Genome Research Institute
Curated by ChEMBL
LigandPNGBDBM50303399(CHEMBL566933 | S-2-(3-chloro-4-methylphenylamino)-...)
Affinity DataIC50: >6.00E+4nM. Assay description: Inhibition of Tryapanosom cruzi cruzain by quantitative high throughput screening
In DepthDetails ArticlePubMed