BDBM50303450 3-(Isobutyryloxy)lup-20(29)-en-28-oic Acid::CHEMBL571294
SMILES CC(C)C(=O)O[C@H]1CC[C@@]2(C)[C@@H](CC[C@]3(C)[C@@H]2CC[C@@H]2[C@H]4[C@@H](CC[C@@]4(CC[C@@]32C)C(O)=O)C(C)=C)C1(C)C
InChI Key InChIKey=OVNHEFOSCNRIIC-WVRTZRCQSA-N
Data  1 EC50
  Tab Delimited (TSV)   2D SDfile   Computed 3D by Vconf -m prep SDfile
Find this compound or compounds like it in BindingDB:
Activity Spreadsheet -- Enzyme Inhibition Constant Data from BindingDB
Found 1 hit for monomerid = 50303450
TargetG-protein coupled bile acid receptor 1(Homo sapiens (Human))
Universite Louis Pasteur
Curated by ChEMBL
LigandPNGBDBM50303450(3-(Isobutyryloxy)lup-20(29)-en-28-oic Acid | CHEMB...)
Affinity DataEC50: >1.00E+4nM. Assay description: Agonist activity at TGR5 expressed in CHO cells by CRE-driven luciferase reporter gene assay
In DepthDetails ArticlePubMed