BDBM50303737 5-Adamantan-1-yl-2-amino-5-(4-butoxy-phenyl)-3-methyl-3,5-dihydro-imidazol-4-one::CHEMBL585286
SMILES CCCCOc1ccc(cc1)C1(N=C(N)N(C)C1=O)C12CC3CC(CC(C3)C1)C2
InChI Key InChIKey=JJIVIBNFUQPABT-UHFFFAOYSA-N
Data  4 IC50  1 EC50
  Tab Delimited (TSV)   2D SDfile   Computed 3D by Vconf -m prep SDfile
Find this compound or compounds like it in BindingDB:
Activity Spreadsheet -- Enzyme Inhibition Constant Data from BindingDB
Found 5 hits for monomerid = 50303737
TargetBeta-secretase 1(Homo sapiens (Human))
Wyeth Research
Curated by ChEMBL
LigandPNGBDBM50303737(5-Adamantan-1-yl-2-amino-5-(4-butoxy-phenyl)-3-met...)
Affinity DataIC50:  870nM. Assay description: Inhibition of human BACE1 by FRET based peptide cleavage assay
In DepthDetails ArticlePubMed
TargetBeta-secretase 1(Homo sapiens (Human))
Wyeth Research
Curated by ChEMBL
LigandPNGBDBM50303737(5-Adamantan-1-yl-2-amino-5-(4-butoxy-phenyl)-3-met...)
Affinity DataEC50:  570nM. Assay description: Inhibition of BACE1 expressed in CHOK1 cells coexpressing human recombinant wild type APP assessed as blockade of amyloid beta production by ELISA
In DepthDetails ArticlePubMed
TargetCathepsin D(Homo sapiens (Human))
Wyeth Research
Curated by ChEMBL
LigandPNGBDBM50303737(5-Adamantan-1-yl-2-amino-5-(4-butoxy-phenyl)-3-met...)
Affinity DataIC50:  8.40E+3nM. Assay description: Inhibition of human cathepsin D by FRET based peptide cleavage assay
In DepthDetails ArticlePubMed
TargetBeta-secretase 2(Homo sapiens (Human))
Wyeth Research
Curated by ChEMBL
LigandPNGBDBM50303737(5-Adamantan-1-yl-2-amino-5-(4-butoxy-phenyl)-3-met...)
Affinity DataIC50:  5.55E+3nM. Assay description: Inhibition of human BACE2 by FRET based peptide cleavage assay
In DepthDetails ArticlePubMed
TargetBeta-secretase 1(Homo sapiens (Human))
Wyeth Research
Curated by ChEMBL
LigandPNGBDBM50303737(5-Adamantan-1-yl-2-amino-5-(4-butoxy-phenyl)-3-met...)
Affinity DataIC50:  871nM. Assay description: Inhibition of human BACE1
In DepthDetails ArticlePubMed