BDBM50303861 4-Amino-5-fluoro-1-(2-ethylbutyl)-2-[5-(2-phosphono)furanyl]-benzimisdazole::CHEMBL585946
SMILES CCC(CC)Cn1c(nc2c(N)c(F)ccc12)-c1ccc(o1)P(O)(O)=O
InChI Key InChIKey=QOLSJCYMNQRVCZ-UHFFFAOYSA-N
Data  2 IC50
  Tab Delimited (TSV)   2D SDfile   Computed 3D by Vconf -m prep SDfile
Find this compound or compounds like it in BindingDB:
Activity Spreadsheet -- Enzyme Inhibition Constant Data from BindingDB
Found 2 hits for monomerid = 50303861
TargetFructose-1,6-bisphosphatase 1(Rattus norvegicus)
Metabasis Therapeutics
Curated by ChEMBL
LigandPNGBDBM50303861(4-Amino-5-fluoro-1-(2-ethylbutyl)-2-[5-(2-phosphon...)
Affinity DataIC50:  850nM. Assay description: Inhibition of rat liver FBPase 1
In DepthDetails ArticlePubMed
TargetFructose-1,6-bisphosphatase 1(Homo sapiens (Human))
Metabasis Therapeutics
Curated by ChEMBL
LigandPNGBDBM50303861(4-Amino-5-fluoro-1-(2-ethylbutyl)-2-[5-(2-phosphon...)
Affinity DataIC50:  150nM. Assay description: Inhibition of human liver FBPase 1
In DepthDetails ArticlePubMed