BDBM50303871 4-Amino-7-cyclopropyl-5-fluoro-1-isobutyl-2-[5-(2-phosphono)-furanyl]-benzimidazole::CHEMBL571017
SMILES CC(C)Cn1c(nc2c(N)c(F)cc(C3CC3)c12)-c1ccc(o1)P(O)(O)=O
InChI Key InChIKey=SMHGGPUELUHOHO-UHFFFAOYSA-N
Data  2 IC50
  Tab Delimited (TSV)   2D SDfile   Computed 3D by Vconf -m prep SDfile
Find this compound or compounds like it in BindingDB:
Activity Spreadsheet -- Enzyme Inhibition Constant Data from BindingDB
Found 2 hits for monomerid = 50303871
TargetFructose-1,6-bisphosphatase 1(Rattus norvegicus)
Metabasis Therapeutics
Curated by ChEMBL
LigandPNGBDBM50303871(4-Amino-7-cyclopropyl-5-fluoro-1-isobutyl-2-[5-(2-...)
Affinity DataIC50:  350nM. Assay description: Inhibition of rat liver FBPase 1
In DepthDetails ArticlePubMed
TargetFructose-1,6-bisphosphatase 1(Homo sapiens (Human))
Metabasis Therapeutics
Curated by ChEMBL
LigandPNGBDBM50303871(4-Amino-7-cyclopropyl-5-fluoro-1-isobutyl-2-[5-(2-...)
Affinity DataIC50:  60nM. Assay description: Inhibition of human liver FBPase 1
In DepthDetails ArticlePubMed