BDBM50303876 4-Amino-7-(3,3-dimethyl-n-butyl)-5-fluoro-1-isobutyl-2-[5-(2-phosphono)furanyl]-benzimidazole::CHEMBL585915
SMILES CC(C)Cn1c(nc2c(N)c(F)cc(CCC(C)(C)C)c12)-c1ccc(o1)P(O)(O)=O
InChI Key InChIKey=FKNDRSSCPBIISY-UHFFFAOYSA-N
Data  2 IC50
  Tab Delimited (TSV)   2D SDfile   Computed 3D by Vconf -m prep SDfile
Find this compound or compounds like it in BindingDB:
Activity Spreadsheet -- Enzyme Inhibition Constant Data from BindingDB
Found 2 hits for monomerid = 50303876
TargetFructose-1,6-bisphosphatase 1(Rattus norvegicus)
Metabasis Therapeutics
Curated by ChEMBL
LigandPNGBDBM50303876(4-Amino-7-(3,3-dimethyl-n-butyl)-5-fluoro-1-isobut...)
Affinity DataIC50:  1.60E+3nM. Assay description: Inhibition of rat liver FBPase 1
In DepthDetails ArticlePubMed
TargetFructose-1,6-bisphosphatase 1(Homo sapiens (Human))
Metabasis Therapeutics
Curated by ChEMBL
LigandPNGBDBM50303876(4-Amino-7-(3,3-dimethyl-n-butyl)-5-fluoro-1-isobut...)
Affinity DataIC50:  210nM. Assay description: Inhibition of human liver FBPase 1
In DepthDetails ArticlePubMed