BDBM50304039 CHEMBL596145::Diphosphoric Acid 1''-alpha-D-[6'']Mannopyranosyl Ester 2-(uridin-5'-yl)ester
SMILES O[C@@H]1[C@@H](COP(O)(=O)OP(O)(=O)OC[C@H]2O[C@H](O)[C@@H](O)[C@@H](O)[C@@H]2O)O[C@H]([C@@H]1O)n1ccc(=O)[nH]c1=O
InChI Key InChIKey=BIYAWWLTVPCMIC-JFLIVUOKSA-N
Data  1 EC50
  Tab Delimited (TSV)   2D SDfile   Computed 3D by Vconf -m prep SDfile
Find this compound or compounds like it in BindingDB:
Activity Spreadsheet -- Enzyme Inhibition Constant Data from BindingDB
Found 1 hit for monomerid = 50304039
TargetP2Y purinoceptor 14(Homo sapiens (Human))
National Institute Of Diabetes And Digestive And Kidney Diseases
Curated by ChEMBL
LigandPNGBDBM50304039(CHEMBL596145 | Diphosphoric Acid 1''-alpha-D-[6'']...)
Affinity DataEC50:  658nM. Assay description: Agonist activity at human P2Y14 receptor expressed in human COS7 cells
In DepthDetails ArticlePubMed