BDBM50304050 1-[3beta-(4-Chloro-phenyl)tropane-2beta-carbonyl-oxy]-2-[4-(3beta-{4-chloro-phenyl}tropane-2beta-carbonyl-oxy-methyl)-(1,2,3)triazol-1-yl]ethane::CHEMBL595638
SMILES CN1C2CCC1[C@@H]([C@H](C2)c1ccc(Cl)cc1)C(=O)OCCn1cc(COC(=O)[C@@H]2C3CCC(C[C@@H]2c2ccc(Cl)cc2)N3C)nn1
InChI Key InChIKey=LLOHGZFZQFVZTC-JLZXWRJPSA-N
Data  3 KI
  Tab Delimited (TSV)   2D SDfile   Computed 3D by Vconf -m prep SDfile
Find this compound or compounds like it in BindingDB:
Activity Spreadsheet -- Enzyme Inhibition Constant Data from BindingDB
Found 3 hits for monomerid = 50304050
TargetSodium-dependent dopamine transporter(Homo sapiens (Human))
Aarhus University
Curated by ChEMBL
LigandPNGBDBM50304050(1-[3beta-(4-Chloro-phenyl)tropane-2beta-carbonyl-o...)
Affinity DataKi:  16nM. Assay description: Displacement of [125I]methyl 3-(4-iodophenyl)-8-methyl-8-aza-bicyclo[3.2.1]octane-2-carboxylate from human recombinant DAT expressed in african green...
In DepthDetails ArticlePubMed
TargetSodium-dependent serotonin transporter(Homo sapiens (Human))
Aarhus University
Curated by ChEMBL
LigandPNGBDBM50304050(1-[3beta-(4-Chloro-phenyl)tropane-2beta-carbonyl-o...)
Affinity DataKi:  27nM. Assay description: Displacement of [125I]methyl 3-(4-iodophenyl)-8-methyl-8-aza-bicyclo[3.2.1]octane-2-carboxylate from human recombinant SERT expressed in african gree...
In DepthDetails ArticlePubMed
TargetSodium-dependent noradrenaline transporter(Homo sapiens (Human))
Aarhus University
Curated by ChEMBL
LigandPNGBDBM50304050(1-[3beta-(4-Chloro-phenyl)tropane-2beta-carbonyl-o...)
Affinity DataKi:  120nM. Assay description: Displacement of [125I]methyl 3-(4-iodophenyl)-8-methyl-8-aza-bicyclo[3.2.1]octane-2-carboxylate from human recombinant NET expressed in african green...
In DepthDetails ArticlePubMed