BDBM50304073 4-(4-Hydroxy-3-methoxy-phenyl)-butan-2-one::CHEMBL25894::ZINGERONE
SMILES COc1cc(CCC(C)=O)ccc1O
InChI Key InChIKey=OJYLAHXKWMRDGS-UHFFFAOYSA-N
Data  2 IC50
  Tab Delimited (TSV)   2D SDfile   Computed 3D by Vconf -m prep SDfile
Find this compound or compounds like it in BindingDB:
Activity Spreadsheet -- Enzyme Inhibition Constant Data from BindingDB
Found 2 hits for monomerid = 50304073
TargetAndrogen receptor(Homo sapiens (Human))
Meijo University
Curated by ChEMBL
LigandPNGBDBM50304073(4-(4-Hydroxy-3-methoxy-phenyl)-butan-2-one | CHEMB...)
Affinity DataIC50:  1.53E+5nM. Assay description: Antagonist activity at AR in human MDA-kb2 cells cotransfected with MMTV-luc assessed as decrease in DHT-induced luciferase activity by reporter gene...
In DepthDetails ArticlePubMed
TargetPolyphenol oxidase 2(Agaricus bisporus (Common mushroom))
Kyoto Pharmaceutical University
Curated by ChEMBL
LigandPNGBDBM50304073(4-(4-Hydroxy-3-methoxy-phenyl)-butan-2-one | CHEMB...)
Affinity DataIC50: >1.00E+5nM. Assay description: Inhibition of mushroom tyrosinase
In DepthDetails ArticlePubMed